{"text_format":"1","workbook":"xlsx","n_sheets":16,"sheets":["A1.1 LDC Information","A2.1 Table of Contents","B1.1 Re-Based Bill Det & Rates","B1.2 Removal of Rate Adders","B1.3 Re-Based Rev From Rates","B1.4 Re-Based Rev Req","C1.1 Ld Act-Mst Rcent Yr","F1.2 CalcTaxChg RRider OptA FV","D1.1 Current Revenue from Rates","E1.1 Threshold Parameters","E2.1 Threshold Test","E3.1 Summary of I C Projects","E4.1 IncrementalCapitalAdjust","F1.1 Incr Cap RRider Opt A FV","F1.2 Incr Cap RRider Opt B Var","Z1.0 OEB Control Sheet"],"not_rendered":{"charts":0,"images":3,"macros":1,"external_links":0,"defined_names":16,"comments":0,"pivot_tables":0},"unopened":[],"bounds":{"document_bytes":16777216,"sheet_cells":100000,"rows_first":2000,"rows_last":500,"rows_between":2000,"halvings":0,"cell_chars":16384,"cell_head_chars":4096},"cells_cut":0,"cells_raw":0,"read":"whole","date_system":"1900"}

{"sheet":"A1.1 LDC Information","index":0,"n_rows":100,"n_cols":27,"rows_kept":100,"cut":false,"hidden":false,"merged":[[19,3,19,4],[18,2,18,7],[1,2,1,9],[2,2,2,9],[3,2,3,9],[4,2,4,9]]}
[]
[]
[]
[]
[]
[]
[]
[]
[]
[]
[]
[]
[]
[]
[]
[]
[]
[]
[]
[null,null,"Applicant Name",null,null,"OEB Audit",null,null,null,null,null,null,null,null,null,null,null,null,null,null,null,null,null,null,null,null,"Company Name"]
{"$rows_left_out":81}
{"sheet":"A2.1 Table of Contents","index":1,"n_rows":50,"n_cols":4,"rows_kept":50,"cut":false,"hidden":false,"merged":[]}
[]
[]
[]
[]
[]
[]
[]
[]
[]
[null,null,{"$f":"'Z1.0 OEB Control Sheet'!C3","v":"Table of Contents"}]
[]
[]
[]
[]
[]
[]
[]
[]
[]
[null,null,"Sheet Name","Purpose of Sheet"]
{"$rows_left_out":31}
{"sheet":"B1.1 Re-Based Bill Det & Rates","index":2,"n_rows":46,"n_cols":51,"rows_kept":46,"cut":false,"hidden":false,"merged":[[11,2,11,12]]}
[]
[]
[]
[]
[]
[]
[]
[]
[]
[null,null,{"$f":"'Z1.0 OEB Control Sheet'!C4","v":"Rate Class and Re-Based Billing Determinants & Rates"}]
[]
[null,null,"Select the appropriate Rate Groups and Rate Classes from the drop-down menus in Columns C and D respectively.  Following your selection, all appropriate input cells will be shaded green. Please input the billing determinants and base distribution rates from your last cost of service based rate application.\n"]
[]
[]
[]
[null,null,null,"Last COS Re-based Year",null,null,null,null,{"$f":"'A1.1 LDC Information'!D34","v":2014}]
[]
[null,null,null,"Last COS OEB Application Number",null,null,null,null,{"$f":"'A1.1 LDC Information'!D36","v":0}]
[]
[null,"Control","Rate Group","Rate Class","Fixed Metric","Vol Metric","OEB Audit",null,"Re-based Billed Customers or Connections","Re-based Billed kWh","Re-based Billed kW",null,"Re-based Tariff Service Charge","Re-based Tariff Distribution Volumetric Rate kWh","Re-based Tariff Distribution Volumetric Rate kW",null,null,null,null,null,null,null,null,null,null,null,"Residential","Threshold",null,"Less Than 50","Threshold",null,"Greater Than 50","Threshold",null,"Large Use","Threshold",null,"USL","Threshold",null,"Sentinel","Threshold",null,"Street","Threshold",null,"EMB",null,null,"SB"]
{"$rows_left_out":27}
{"sheet":"B1.2 Removal of Rate Adders","index":3,"n_rows":46,"n_cols":15,"rows_kept":46,"cut":false,"hidden":false,"merged":[]}
[]
[]
[]
[]
[]
[]
[]
[]
[]
[null,null,{"$f":"'Z1.0 OEB Control Sheet'!C5","v":"Removal of Rate Adders"}]
[]
[]
[null,null,"Last COS Re-based Year",null,null,{"$f":"'A1.1 LDC Information'!D34","v":2014}]
[]
[null,null,"Last COS OEB Application Number",null,null,{"$f":"'A1.1 LDC Information'!D36","v":0}]
[]
[]
[]
[]
[null,null,"Rate Class",null,"Re-based Tariff Service Charge","Re-based Tariff Distribution Volumetric Rate kWh","Re-based Tariff Distribution Volumetric Rate kW",null,"Service Charge Rate Adders","Distribution Volumetric kWh Rate Adders","Distribution Volumetric kW Rate Adders",null,"Re-based Base Service Charge","Re-based Base Distribution Volumetric Rate kWh","Re-based Base Distribution Volumetric Rate kW"]
{"$rows_left_out":27}
{"sheet":"B1.3 Re-Based Rev From Rates","index":4,"n_rows":48,"n_cols":21,"rows_kept":48,"cut":false,"hidden":false,"merged":[]}
[]
[]
[]
[]
[]
[]
[]
[]
[]
[null,null,{"$f":"'Z1.0 OEB Control Sheet'!C6","v":"Calculated Re-Based Revenue From Rates"}]
[]
[]
[null,null,"Last COS Re-based Year",null,null,{"$f":"'A1.1 LDC Information'!D34","v":2014}]
[]
[null,null,"Last COS OEB Application Number",null,null,{"$f":"'A1.1 LDC Information'!D36","v":0}]
[]
[]
[]
[]
[null,null,"Rate Class",null,"Re-based Billed Customers or Connections","Re-based Billed kWh","Re-based Billed kW",null,"Re-based Base Service Charge","Re-based Base Distribution Volumetric Rate kWh","Re-based Base Distribution Volumetric Rate kW",null,"Service Charge Revenue","Distribution Volumetric Rate Revenue \nkWh","Distribution Volumetric Rate Revenue \nkW","Revenue Requirement from Rates",null,"Service Charge % Revenue","Distribution Volumetric Rate % Revenue \nkWh","Distribution Volumetric Rate % Revenue \nkW","Total % Revenue"]
{"$rows_left_out":29}
{"sheet":"B1.4 Re-Based Rev Req","index":5,"n_rows":82,"n_cols":11,"rows_kept":82,"cut":false,"hidden":false,"merged":[[19,4,19,7]]}
[]
[]
[]
[]
[]
[]
[]
[]
[]
[null,null,{"$f":"'Z1.0 OEB Control Sheet'!C7","v":"Detailed Re-Based Revenue From Rates"}]
[]
[]
[null,null,"Last COS Re-based Year",null,{"$f":"'A1.1 LDC Information'!D34","v":2014}]
[]
[null,null,"Last COS OEB Application Number",null,{"$f":"'A1.1 LDC Information'!D36","v":0}]
[]
[]
[]
[]
[null,null,"Applicants Rate Base",null,"Last Rate Re-based Amount",null,null,null,"OEB Audit"]
{"$rows_left_out":63}
{"sheet":"C1.1 Ld Act-Mst Rcent Yr","index":6,"n_rows":47,"n_cols":21,"rows_kept":47,"cut":false,"hidden":false,"merged":[]}
[]
[]
[]
[]
[]
[]
[]
[]
[]
[null,null,{"$f":"'Z1.0 OEB Control Sheet'!C9","v":"Load Actual - 2013 Actual"}]
[]
[null,null,{"$f":"MostRecentYear('A1.1 LDC Information'!D34)","v":""}]
[]
[]
[]
[]
[]
[]
[]
[null,"Control","Rate Class","Fixed Metric","Vol Metric","OEB Audit",null,"Billed Customers or Connections","Billed kWh","Billed kW",null,"Base Service Charge","Base Distribution Volumetric Rate kWh","Base Distribution Volumetric Rate kW",null,"Service Charge Revenue","Distribution Volumetric Rate Revenue \nkWh","Distribution Volumetric Rate Revenue \nkW","Total Revenue by Rate Class"]
{"$rows_left_out":28}
{"sheet":"F1.2 CalcTaxChg RRider OptA FV","index":7,"n_rows":50,"n_cols":22,"rows_kept":50,"cut":false,"hidden":true,"merged":[[49,19,49,21]]}
[]
[null,null,{"$f":"'A1.1 LDC Information'!C2","v":0}]
[null,null,{"$f":"'A1.1 LDC Information'!C3","v":0}]
[null,null,{"$f":"'A1.1 LDC Information'!C4","v":0}]
[]
[]
[]
[]
[]
[null,null,{"$f":"'Z1.0 OEB Control Sheet'!#REF!","v":{"$error":"#REF!"}}]
[]
[]
[]
[]
[]
[]
[]
[]
[]
[null,"Control","Rate Class","Fixed Metric","Vol Metric",null,"Service Charge % Revenue","Distribution Volumetric Rate % Revenue \nkWh","Distribution Volumetric Rate % Revenue \nkW",null,"Service Charge Revenue","Distribution Volumetric Rate Revenue \nkWh","Distribution Volumetric Rate Revenue \nkW","Total Revenue by Rate Class",null,"Billed Customers or Connections","Billed kWh","Billed kW",null,"Service Charge Rate Rider","Distribution Volumetric Rate kWh Rate Rider","Distribution Volumetric Rate kW Rate Rider"]
{"$rows_left_out":31}
{"sheet":"D1.1 Current Revenue from Rates","index":8,"n_rows":49,"n_cols":23,"rows_kept":49,"cut":false,"hidden":false,"merged":[[48,6,48,8],[7,2,7,9]]}
[]
[]
[]
[]
[]
[]
[]
[null,null,"This sheet is used to determine the applicants most current allocation of revenues (after the most recent revenue to cost ratio adjustment, if applicable)  to be used to calculate the incremental capital rate riders.  \n"]
[]
[]
[]
[]
[]
[]
[]
[]
[]
[null,null,{"$f":"'Z1.0 OEB Control Sheet'!C10","v":"Current Revenue from Rates"}]
[]
[null,null,"Rate Class",{"$f":"'B1.1 Re-Based Bill Det & Rates'!E20","v":"Fixed Metric"},{"$f":"'B1.1 Re-Based Bill Det & Rates'!F20","v":"Vol Metric"},null,"Current Base Service Charge","Current Base Distribution Volumetric Rate kWh","Current Base Distribution Volumetric Rate kW",null,{"$f":"'B1.1 Re-Based Bill Det & Rates'!I20","v":"Re-based Billed Customers or Connections"},{"$f":"'B1.1 Re-Based Bill Det & Rates'!J20","v":"Re-based Billed kWh"},{"$f":"'B1.1 Re-Based Bill Det & Rates'!K20","v":"Re-based Billed kW"},null,"Current Base Service Charge Revenue","Current Base Distribution Volumetric Rate kWh Revenue","Current Base Distribution Volumetric Rate kW Revenue","Total Current Base Revenue",null,"Service Charge % Total Revenue","Distribution Volumetric Rate % Total Revenue ","Distribution Volumetric Rate % Total Revenue ","Total % Revenue"]
{"$rows_left_out":30}
{"sheet":"E1.1 Threshold Parameters","index":9,"n_rows":40,"n_cols":17,"rows_kept":40,"cut":false,"hidden":false,"merged":[]}
[]
[]
[]
[]
[]
[]
[]
[]
[]
[null,null,{"$f":"'Z1.0 OEB Control Sheet'!C11","v":"Threshold Parameters"}]
[]
[]
[]
[]
[]
[]
[]
[]
[]
[null,null,"Price Cap Index"]
{"$rows_left_out":21}
{"sheet":"E2.1 Threshold Test","index":10,"n_rows":60,"n_cols":6,"rows_kept":60,"cut":false,"hidden":false,"merged":[]}
[]
[]
[]
[]
[]
[]
[]
[]
[]
[null,null,{"$f":"'Z1.0 OEB Control Sheet'!C12","v":"Threshold Test"}]
[]
[]
[]
[]
[]
[]
[]
[]
[]
[null,null,"Year",null,{"$f":"'A1.1 LDC Information'!D34","v":2014}]
{"$rows_left_out":41}
{"sheet":"E3.1 Summary of I C Projects","index":11,"n_rows":65,"n_cols":10,"rows_kept":65,"cut":false,"hidden":false,"merged":[[64,3,65,5]]}
[]
[]
[]
[]
[]
[]
[]
[]
[]
[null,null,{"$f":"'Z1.0 OEB Control Sheet'!C13 & \" (ICPs)\"","v":"Summary of Incremental Capital Projects (ICPs)"}]
[]
[]
[]
[]
[]
[]
[]
[]
[null,null,null,"Calculation of Eligible Incremental Capital Amount"]
[]
{"$rows_left_out":46}
{"sheet":"E4.1 IncrementalCapitalAdjust","index":12,"n_rows":88,"n_cols":13,"rows_kept":88,"cut":false,"hidden":false,"merged":[]}
[]
[]
[]
[]
[]
[]
[]
[]
[]
[]
[null,null,{"$f":"'Z1.0 OEB Control Sheet'!C14","v":"Incremental Capital Adjustment"}]
[]
[]
[]
[]
[]
[]
[]
[]
[]
{"$rows_left_out":69}
{"sheet":"F1.1 Incr Cap RRider Opt A FV","index":13,"n_rows":49,"n_cols":22,"rows_kept":49,"cut":false,"hidden":false,"merged":[[48,19,48,21]]}
[]
[]
[]
[]
[]
[]
[]
[]
[]
[null,null,{"$f":"'Z1.0 OEB Control Sheet'!C15","v":"Calculation of Incremental Capital Rate Rider - Option A Fixed and Variable"}]
[]
[]
[]
[]
[]
[]
[]
[]
[]
[null,"Control","Rate Class","Fixed Metric","Vol Metric",null,"Service Charge % Revenue","Distribution Volumetric Rate % Revenue \nkWh","Distribution Volumetric Rate % Revenue \nkW",null,"Service Charge Revenue","Distribution Volumetric Rate Revenue \nkWh","Distribution Volumetric Rate Revenue \nkW","Total Revenue by Rate Class",null,"Billed Customers or Connections","Billed kWh","Billed kW",null,"Service Charge Rate Rider","Distribution Volumetric Rate kWh Rate Rider","Distribution Volumetric Rate kW Rate Rider"]
{"$rows_left_out":30}
{"sheet":"F1.2 Incr Cap RRider Opt B Var","index":14,"n_rows":48,"n_cols":20,"rows_kept":48,"cut":false,"hidden":false,"merged":[[47,16,49,18]]}
[]
[]
[]
[]
[]
[]
[]
[]
[]
[null,null,{"$f":"'Z1.0 OEB Control Sheet'!C16","v":"Calculation of Incremental Capital Rate Rider - Option B Variable"}]
[]
[]
[]
[]
[]
[]
[]
[]
[]
[null,"Control","Rate Class","Fixed Metric","Vol Metric",null,"Total Revenue $ by Rate Class",null,"Total Revenue % by Rate Class",null,"Total Incremental Capital $ by Rate Class",null,"Billed kWh",null,"Billed kW",null,"Distribution Volumetric Rate kWh Rate Rider",null,"Distribution Volumetric Rate kW Rate Rider"]
{"$rows_left_out":29}
{"sheet":"Z1.0 OEB Control Sheet","index":15,"n_rows":17,"n_cols":7,"rows_kept":17,"cut":false,"hidden":true,"merged":[]}
["Sheet Number","Assignment","Sheet Title","Core Sheet Name","Chrs","OEB Audit","Purpose of Sheet"]
["Sheet1","A1.1","LDC Information","A1.1 LDC Information",{"$f":"LEN(D2)","v":20},"No","Enter LDC Data"]
["Sheet2","A2.1","Table of Contents","A2.1 Table of Contents",22,"No","Table of Contents"]
["Sheet3","B1.1","Rate Class and Re-Based Billing Determinants & Rates","B1.1 Re-Based Bill Det & Rates",30,"No","Set Up Rate Classes and enter Re-Based Billing Determinants and Tariff Rates "]
["Sheet4","B1.2","Removal of Rate Adders","B1.2 Removal of Rate Adders",27,"No","Removal of Rate Adders"]
["Sheet5","B1.3","Calculated Re-Based Revenue From Rates","B1.3 Re-Based Rev From Rates",28,"No","Calculated Re-Based Revenue From Rates"]
["Sheet6","B1.4","Detailed Re-Based Revenue From Rates","B1.4 Re-Based Rev Req",21,"No","Detailed Re-Based Revenue From Rates"]
["Sheet7","B2.1","2010 Base Distribution Rates","B2.1 2010 Base Dist Rates",25,"No","2010 Base Distribution Rates"]
["Sheet8","C1.1",{"$f":" IF(ISERROR(SEARCH(\"Actual\",'A1.1 LDC Information'!D38)),\"Load Actual - \" & 'A1.1 LDC Information'!D40,\"Load Actual - \" & 'A1.1 LDC Information'!D38)","v":"Load Actual - 2013 Actual"},"C1.1 Ld Act-Mst Rcent Yr",24,"No","Enter Billing Determinants for most recent actual year"]
["Sheet9","D1.1","Current Revenue from Rates","D1.1 Current Revenue from Rates",31,"No","Enter Current Rates to calculate current rate allocation"]
["Sheet10","E1.1","Threshold Parameters","E1.1 Threshold Parameters",25,"No","Shows calculation of Price Cap and Growth used for incremental capital threshold calculation"]
["Sheet11","E2.1","Threshold Test","E2.1 Threshold Test",19,"No","Input sheet to calculate Threshold and Incremental Capital"]
["Sheet12","E3.1","Summary of Incremental Capital Projects","E3.1 Summary of I C Projects",28,"No","Summary of Incremental Capital Projects"]
["Sheet13","E4.1","Incremental Capital Adjustment","E4.1 IncrementalCapitalAdjust",29,"No","Shows Calculation of Incremental Capital Revenue Requirement"]
["Sheet14","F1.1","Calculation of Incremental Capital Rate Rider - Option A Fixed and Variable","F1.1 Incr Cap RRider Opt A FV",29,"No","Option A - Calculation of Incremental Capital Rate Rider - Fixed & Variable Split"]
["Sheet15","F1.2","Calculation of Incremental Capital Rate Rider - Option B Variable","F1.2 Incr Cap RRider Opt B Var",30,"No","Option B - Calculation of Incremental Capital Rate Rider - Variable Allocation"]
["Sheet16","Z1.0","OEB Control Sheet","Z1.0 OEB Control Sheet",22,"N/A","Not Shown"]